Reaction Details
Target11-beta-hydroxysteroid dehydrogenase 1
LigandBDBM107484
Substrate/Competitorn/a
Meas. Tech.Biological Assay Example 1
IC50 1.48±0.0 nM
Citation Renz, MSchuehle, MXu, Z Cyclic inhibitors of 11beta-hydroxysteroid dehydrogenase 1 US Patent US8575157 Publication Date 11/5/2013
 
11-beta-hydroxysteroid dehydrogenase 1
Name:11-beta-hydroxysteroid dehydrogenase 1
Type:Enzyme
Mol. Mass.:32409.16
Organism:Homo sapiens (Human)
Description:P28845
Residue:292
BDBM107484
NameBDBM107484
Synonyms:US8575157, 194 US8598163, 64
TypeSmall organic molecule
Emp. Form.C28H28F3NO3
Mol. Mass.483.522
SMILESC[C@H](N1CC[C@@](CC(C)(C)O)(OC1=O)c1ccc(F)cc1)c1ccc(cc1)-c1ccc(F)cc1F