Reaction Details
Target11-beta-hydroxysteroid dehydrogenase 1
LigandBDBM50353405
Substrate/Competitorn/a
Meas. Tech.Biological Assay Example 1
IC50 0.72±0.0 nM
Citation Renz, MSchuehle, MXu, Z Cyclic inhibitors of 11beta-hydroxysteroid dehydrogenase 1 US Patent US8575157 Publication Date 11/5/2013
 
11-beta-hydroxysteroid dehydrogenase 1
Name:11-beta-hydroxysteroid dehydrogenase 1
Type:Enzyme
Mol. Mass.:32409.16
Organism:Homo sapiens (Human)
Description:P28845
Residue:292
BDBM50353405
NameBDBM50353405
Synonyms:CHEMBL1829759 US8592410, 93 | US8592410, Comparator 8
TypeSmall organic molecule
Emp. Form.C27H27F2NO3
Mol. Mass.451.505
SMILESC[C@H](N1CC[C@@](CCCO)(OC1=O)c1ccccc1)c1ccc(cc1)-c1ccc(F)cc1F