Reaction Details
Target11-beta-hydroxysteroid dehydrogenase 1
LigandBDBM107485
Substrate/Competitorn/a
Meas. Tech.Biological Assay Example 1
IC50 0.55±0.0 nM
Citation Renz, MSchuehle, MXu, Z Cyclic inhibitors of 11beta-hydroxysteroid dehydrogenase 1 US Patent US8575157 Publication Date 11/5/2013
 
11-beta-hydroxysteroid dehydrogenase 1
Name:11-beta-hydroxysteroid dehydrogenase 1
Type:Enzyme
Mol. Mass.:32409.16
Organism:Homo sapiens (Human)
Description:P28845
Residue:292
BDBM107485
NameBDBM107485
Synonyms:US8575157, 199 US8598163, 69
TypeSmall organic molecule
Emp. Form.C27H27FN2O3
Mol. Mass.446.5133
SMILESC[C@H](N1CC[C@@](CCC(N)=O)(OC1=O)c1ccccc1)c1ccc(cc1)-c1ccc(F)cc1