Reaction Details
Target11-beta-hydroxysteroid dehydrogenase 1
LigandBDBM107488
Substrate/Competitorn/a
Meas. Tech.Biological Assay Example 1
IC50 1.30±0.0 nM
Citation Renz, MSchuehle, MXu, Z Cyclic inhibitors of 11beta-hydroxysteroid dehydrogenase 1 US Patent US8575157 Publication Date 11/5/2013
 
11-beta-hydroxysteroid dehydrogenase 1
Name:11-beta-hydroxysteroid dehydrogenase 1
Type:Enzyme
Mol. Mass.:32409.16
Organism:Homo sapiens (Human)
Description:P28845
Residue:292
BDBM107488
NameBDBM107488
Synonyms:US8575157, 202 US8598163, 72
TypeSmall organic molecule
Emp. Form.C21H22F3NO4
Mol. Mass.409.3989
SMILESC[C@H](N1CC[C@@](CCO)(OC1=O)c1ccc(F)cc1)c1ccc(OC(F)F)cc1