Reaction Details
TargetcGMP-dependent 3',5'-cyclic phosphodiesterase
LigandBDBM107767
Substrate/Competitorn/a
Meas. Tech.Inhibition Assay
IC50 1.61±0.0 nM
Citation Helal, CJChappie, TAHumphrey, JMVerhoest, PRYang, E Imidazo[5,1-f][1,2,4]triazines for the treatment of neurological disorders US Patent US8598155 Publication Date 12/3/2013
 
cGMP-dependent 3',5'-cyclic phosphodiesterase
Name:cGMP-dependent 3',5'-cyclic phosphodiesterase
Type:Enzyme Catalytic Domain
Mol. Mass.:105691.58
Organism:Homo sapiens (Human)
Description:O00408
Residue:941
BDBM107767
NameBDBM107767
Synonyms:US11419874, PF-05180999 | US8598155, 2
TypeSmall organic molecule
Emp. Form.C19H17F3N8
Mol. Mass.414.3871
SMILESCc1nc(-c2cnn(C)c2-c2ccc(cn2)C(F)(F)F)c2c(ncnn12)N1CCC1