Reaction Details
TargetTyrosine-protein kinase BTK
LigandBDBM281750
Substrate/Competitorn/a
Meas. Tech.Human Recombinant Btk Enzyme Assay
pH7.4±n/a
Temperature298.15±n/a K
IC50 0.045±n/a nM
Commentsextracted
Citation Watterson, SHTebben, AJAhmad, S Carbazole and tetrahydrocarbazole compounds useful as inhibitors of BTK US Patent US10023534 Publication Date 7/17/2018
 
Tyrosine-protein kinase BTK
Name:Tyrosine-protein kinase BTK
Type:Enzyme
Mol. Mass.:76289.95
Organism:Homo sapiens (Human)
Description:Q06187
Residue:659
BDBM281750
NameBDBM281750
Synonyms:5-(2-Acryloyl-1,2,3,4-tetrahydroisoquinolin-5-yl)-6-fluoro-2-(S)-(2-hydroxypropan-2-yl)-2,3,4,9-tetrahydro-1H-carbazole-8-carboxamide (Single Diastereomer) | US10023534, Example 9
TypeSmall organic molecule
Emp. Form.C28H30FN3O3
Mol. Mass.475.5545
SMILESCC(C)(O)[C@H]1CCc2c(C1)[nH]c1c(cc(F)c(-c3cccc4CN(CCc34)C(=O)C=C)c21)C(N)=O