Reaction Details
TargetHistamine H3 receptor
LigandBDBM108282
Substrate/Competitorn/a
Meas. Tech.Radioligand Binding Assay
Ki 0.07±0.0 nM
Citation Gao, ZHall, DHartung, R Substituted piperidine spiro pyrrolidinone and piperidinone, preparation and therapeutic use thereof US Patent US8604046 Publication Date 12/10/2013
 
Histamine H3 receptor
Name:Histamine H3 receptor
Synonyms:n/a
Type:Enzyme
Mol. Mass.:43426.88
Organism:Macaca mulatta (Rhesus macaque)
Description:G7N499
Residue:390
BDBM108282
NameBDBM108282
Synonyms:US8604046, 62
TypeSmall organic molecule
Emp. Form.C25H38N4O
Mol. Mass.410.5954
SMILESC[C@H]1CCCN1[C@H]1CCN(C1)c1ccc(N2CCCC3(CCNCC3)C2=O)c(C)c1