Reaction Details
TargetHistamine H3 receptor
LigandBDBM108296
Substrate/Competitorn/a
Meas. Tech.Radioligand Binding Assay
Ki 0.1±0.0 nM
Citation Gao, ZHall, DHartung, R Substituted piperidine spiro pyrrolidinone and piperidinone, preparation and therapeutic use thereof US Patent US8604046 Publication Date 12/10/2013
 
Histamine H3 receptor
Name:Histamine H3 receptor
Synonyms:n/a
Type:Enzyme
Mol. Mass.:43426.88
Organism:Macaca mulatta (Rhesus macaque)
Description:G7N499
Residue:390
BDBM108296
NameBDBM108296
Synonyms:US8604046, 76
TypeSmall organic molecule
Emp. Form.C29H39FN4O2
Mol. Mass.494.644
SMILESC[C@H]1CCCN1[C@H]1CCN(C1)c1ccc(N2CCCC3(CCN(Cc4ccco4)CC3)C2=O)c(F)c1