Reaction Details
TargetHistamine H3 receptor
LigandBDBM108310
Substrate/Competitorn/a
Meas. Tech.Radioligand Binding Assay
Ki 0.08±0.0 nM
Citation Gao, ZHall, DHartung, R Substituted piperidine spiro pyrrolidinone and piperidinone, preparation and therapeutic use thereof US Patent US8604046 Publication Date 12/10/2013
 
Histamine H3 receptor
Name:Histamine H3 receptor
Synonyms:n/a
Type:Enzyme
Mol. Mass.:43426.88
Organism:Macaca mulatta (Rhesus macaque)
Description:G7N499
Residue:390
BDBM108310
NameBDBM108310
Synonyms:US8604046, 90
TypeSmall organic molecule
Emp. Form.C31H39FN4O2
Mol. Mass.518.6654
SMILESC[C@H]1CCCN1C1CCN(CC1)c1ccc(cc1)N1CCC2(CCN(CC2)C(=O)c2ccc(F)cc2)C1=O