Reaction Details
TargetGlutaminase kidney isoform, mitochondrial
LigandBDBM108893
Substrate/Competitorn/a
Meas. Tech.Enzyme Assay-Time Dependence
IC50 2±n/a nM
Citation Li, JChen, LGoyal, BLaidig, GStanton, TFSjogren, EB Heterocyclic inhibitors of glutaminase US Patent US8604016 Publication Date 12/10/2013
 
Glutaminase kidney isoform, mitochondrial
Name:Glutaminase kidney isoform, mitochondrial
Type:Protein
Mol. Mass.:73471.89
Organism:Homo sapiens (Human)
Description:O94925
Residue:669
BDBM108893
NameBDBM108893
Synonyms:US8604016, 473 | US9938267, Cmpd ID 473
TypeSmall organic molecule
Emp. Form.C32H35N7O3S
Mol. Mass.597.73
SMILESO=C(Cc1cccc(CC(=O)N2CCCC2)c1)Nc1nnc(CCCCc2ccc(NC(=O)Cc3ccccc3)nn2)s1