Reaction Details
TargetGlutaminase kidney isoform, mitochondrial
LigandBDBM108919
Substrate/Competitorn/a
Meas. Tech.Enzyme Assay-Time Dependence
IC50 4±n/a nM
Citation Li, JChen, LGoyal, BLaidig, GStanton, TFSjogren, EB Heterocyclic inhibitors of glutaminase US Patent US8604016 Publication Date 12/10/2013
 
Glutaminase kidney isoform, mitochondrial
Name:Glutaminase kidney isoform, mitochondrial
Type:Protein
Mol. Mass.:73471.89
Organism:Homo sapiens (Human)
Description:O94925
Residue:669
BDBM108919
NameBDBM108919
Synonyms:US8604016, 500 | US9938267, Cmpd ID 500
TypeSmall organic molecule
Emp. Form.C30H30N8O2S
Mol. Mass.566.677
SMILESO=C(Cc1ccccc1)Nc1nnc(CCCCc2ccc(NC(=O)Cc3cccc(Cn4cccn4)c3)nn2)s1