Reaction Details
TargetGlutaminase kidney isoform, mitochondrial
LigandBDBM108935
Substrate/Competitorn/a
Meas. Tech.Enzyme Assay-Time Dependence
IC50 3±n/a nM
Citation Li, JChen, LGoyal, BLaidig, GStanton, TFSjogren, EB Heterocyclic inhibitors of glutaminase US Patent US8604016 Publication Date 12/10/2013
 
Glutaminase kidney isoform, mitochondrial
Name:Glutaminase kidney isoform, mitochondrial
Type:Protein
Mol. Mass.:73471.89
Organism:Homo sapiens (Human)
Description:O94925
Residue:669
BDBM108935
NameBDBM108935
Synonyms:US8604016, 516
TypeSmall organic molecule
Emp. Form.C32H41N7O3S
Mol. Mass.603.778
SMILESCCCCNC(=O)Cc1cccc(CC(=O)NC(=N)CCC(=N)CCCCc2nnc(NC(=O)Cc3ccccc3)s2)c1