Reaction Details
TargetGlutaminase kidney isoform, mitochondrial
LigandBDBM109040
Substrate/Competitorn/a
Meas. Tech.Enzyme Assay-Time Dependence
IC50 4±n/a nM
Citation Li, JChen, LGoyal, BLaidig, GStanton, TFSjogren, EB Heterocyclic inhibitors of glutaminase US Patent US8604016 Publication Date 12/10/2013
 
Glutaminase kidney isoform, mitochondrial
Name:Glutaminase kidney isoform, mitochondrial
Type:Protein
Mol. Mass.:73471.89
Organism:Homo sapiens (Human)
Description:O94925
Residue:669
BDBM109040
NameBDBM109040
Synonyms:US8604016, 622 | US9938267, Cmpd ID 622
TypeSmall organic molecule
Emp. Form.C30H30F3N7O3S
Mol. Mass.625.665
SMILESCC(NC(=O)C(F)(F)F)c1cccc(CC(=O)Nc2ccc(CCCCc3nnc(NC(=O)Cc4ccccc4)s3)nn2)c1