Reaction Details
TargetGlutaminase kidney isoform, mitochondrial
LigandBDBM109042
Substrate/Competitorn/a
Meas. Tech.Enzyme Assay-Time Dependence
IC50 4±n/a nM
Citation Li, JChen, LGoyal, BLaidig, GStanton, TFSjogren, EB Heterocyclic inhibitors of glutaminase US Patent US8604016 Publication Date 12/10/2013
 
Glutaminase kidney isoform, mitochondrial
Name:Glutaminase kidney isoform, mitochondrial
Type:Protein
Mol. Mass.:73471.89
Organism:Homo sapiens (Human)
Description:O94925
Residue:669
BDBM109042
NameBDBM109042
Synonyms:US8604016, 624
TypeSmall organic molecule
Emp. Form.C31H36F3N7O3S
Mol. Mass.643.723
SMILESCC(NC(=O)CC(F)(F)F)c1cccc(CC(=O)NC(=N)CCC(=N)CCCCc2nnc(NC(=O)Cc3ccccc3)s2)c1