Reaction Details
TargetGlutaminase kidney isoform, mitochondrial
LigandBDBM109087
Substrate/Competitorn/a
Meas. Tech.Enzyme Assay-Time Dependence
IC50 4±n/a nM
Citation Li, JChen, LGoyal, BLaidig, GStanton, TFSjogren, EB Heterocyclic inhibitors of glutaminase US Patent US8604016 Publication Date 12/10/2013
 
Glutaminase kidney isoform, mitochondrial
Name:Glutaminase kidney isoform, mitochondrial
Type:Protein
Mol. Mass.:73471.89
Organism:Homo sapiens (Human)
Description:O94925
Residue:669
BDBM109087
NameBDBM109087
Synonyms:US10793535, Cmpd ID 671 US9938267, Cmpd ID 671
TypeSmall organic molecule
Emp. Form.C26H24F3N7O3S
Mol. Mass.571.574
SMILESFC(F)(F)Oc1cccc(CC(=O)Nc2ccc(CCCCc3nnc(NC(=O)Cc4cccnc4)s3)nn2)c1