Reaction Details
TargetGlutaminase kidney isoform, mitochondrial
LigandBDBM108802
Substrate/Competitorn/a
Meas. Tech.Enzyme Assay
IC50 99±n/a nM
Citation Li, JChen, LGoyal, BLaidig, GStanton, TFSjogren, EB Heterocyclic inhibitors of glutaminase US Patent US8604016 Publication Date 12/10/2013
 
Glutaminase kidney isoform, mitochondrial
Name:Glutaminase kidney isoform, mitochondrial
Type:Protein
Mol. Mass.:73471.89
Organism:Homo sapiens (Human)
Description:O94925
Residue:669
BDBM108802
NameBDBM108802
Synonyms:US8604016, 382 | US9938267, Cmpd ID 382
TypeSmall organic molecule
Emp. Form.C30H33N7O4S
Mol. Mass.587.693
SMILESCCOC(=O)NCc1cccc(CC(=O)Nc2nnc(CCCCc3ccc(NC(=O)Cc4ccccc4)nn3)s2)c1