Reaction Details
TargetAldehyde dehydrogenase, dimeric NADP-preferring
LigandBDBM109210
Substrate/Competitorn/a
Meas. Tech.IC50 Determination
Ki 4.7e+3± 3e+2 nM
IC50 1.6e+4± 5e+2 nM
Citation Parajuli, BGeorgiadis, TMFishel, MLHurley, TD Development of Selective Inhibitors for Human Aldehyde Dehydrogenase 3A1 (ALDH3A1) for the Enhancement of Cyclophosphamide Cytotoxicity. Chembiochem15:701-712 (2014) 
 
Aldehyde dehydrogenase, dimeric NADP-preferring
Name:Aldehyde dehydrogenase, dimeric NADP-preferring
Type:Protein
Mol. Mass.:50394.38
Organism:Homo sapiens (Human)
Description:n/a
Residue:453
BDBM109210
NameBDBM109210
Synonyms:CB29
TypeSmall organic molecule
Emp. Form.C15H15N3O5S
Mol. Mass.349.362
SMILESCC(=O)Nc1ccc(Nc2ccc(cc2[N+]([O-])=O)S(C)(=O)=O)cc1