Reaction Details
TargetCarboxypeptidase B2
LigandBDBM109238
Substrate/Competitorn/a
Meas. Tech.Enzyme Inhibition Assay
IC50 8.3±n/a nM
Citation Nagata, TInoue, MAshida, YNoguchi, KOno, M Cycloalkyl-substituted imidazole derivative US Patent US8609710 Publication Date 12/17/2013
 
Carboxypeptidase B2
Name:Carboxypeptidase B2
Type:Enzyme
Mol. Mass.:48432.74
Organism:Homo sapiens (Human)
Description:Q96IY4
Residue:423
BDBM109238
NameBDBM109238
Synonyms:US8609710, 2
TypeSmall organic molecule
Emp. Form.C16H27N3O2
Mol. Mass.293.4045
SMILESC[C@H]1CC[C@@H](CC1)n1cnc(CC(CCCN)C(O)=O)c1