Reaction Details
TargetCarboxypeptidase B2
LigandBDBM109253
Substrate/Competitorn/a
Meas. Tech.Enzyme Inhibition Assay
IC50 8.1±n/a nM
Citation Nagata, TInoue, MAshida, YNoguchi, KOno, M Cycloalkyl-substituted imidazole derivative US Patent US8609710 Publication Date 12/17/2013
 
Carboxypeptidase B2
Name:Carboxypeptidase B2
Type:Enzyme
Mol. Mass.:48432.74
Organism:Homo sapiens (Human)
Description:Q96IY4
Residue:423
BDBM109253
NameBDBM109253
Synonyms:US8609710, 24
TypeSmall organic molecule
Emp. Form.C15H25N3O3
Mol. Mass.295.3773
SMILESC[C@H]1CC[C@@H](CC1)n1cnc(CC(OCCN)C(O)=O)c1