Reaction Details
TargetCarboxypeptidase B2
LigandBDBM109265
Substrate/Competitorn/a
Meas. Tech.Enzyme Inhibition Assay
IC50 5.1±n/a nM
Citation Nagata, TInoue, MAshida, YNoguchi, KOno, M Cycloalkyl-substituted imidazole derivative US Patent US8609710 Publication Date 12/17/2013
 
Carboxypeptidase B2
Name:Carboxypeptidase B2
Type:Enzyme
Mol. Mass.:48432.74
Organism:Homo sapiens (Human)
Description:Q96IY4
Residue:423
BDBM109265
NameBDBM109265
Synonyms:US8609710, 35 (2S,4R form)
TypeSmall organic molecule
Emp. Form.C17H29N3O2
Mol. Mass.307.4311
SMILESC[C@@H](CN)C[C@@H](Cc1cn(cn1)[C@H]1CC[C@H](C)CC1)C(O)=O