Reaction Details
TargetCarboxypeptidase B2
LigandBDBM109264
Substrate/Competitorn/a
Meas. Tech.Enzyme Inhibition Assay
IC50 2.6±n/a nM
Citation Nagata, TInoue, MAshida, YNoguchi, KOno, M Cycloalkyl-substituted imidazole derivative US Patent US8609710 Publication Date 12/17/2013
 
Carboxypeptidase B2
Name:Carboxypeptidase B2
Type:Enzyme
Mol. Mass.:48432.74
Organism:Homo sapiens (Human)
Description:Q96IY4
Residue:423
BDBM109264
NameBDBM109264
Synonyms:US8609710, 40
TypeSmall organic molecule
Emp. Form.C16H27N3O2
Mol. Mass.293.4045
SMILESC[C@H]1CC[C@@H](CC1)n1cnc(C[C@H](CCCN)C(O)=O)c1