Reaction Details
TargetPhosphatidylinositol 4,5-bisphosphate 3-kinase catalytic subunit alpha isoform
LigandBDBM109314
Substrate/Competitorn/a
Meas. Tech.Biological Assays
IC50 13±n/a nM
Citation Montagne, CBombrun, ADesforges-Bouscary, GQuattropani, AGaillard, P 2-morpholino-pyrido[3,2-D]pyrimidines US Patent US8609666 Publication Date 12/17/2013
 
Phosphatidylinositol 4,5-bisphosphate 3-kinase catalytic subunit alpha isoform
Name:Phosphatidylinositol 4,5-bisphosphate 3-kinase catalytic subunit alpha isoform
Type:Enzyme Subunit
Mol. Mass.:124294.87
Organism:Homo sapiens (Human)
Description:P42336
Residue:1068
BDBM109314
NameBDBM109314
Synonyms:US8609666, 34
TypeSmall organic molecule
Emp. Form.C20H20FN5O4
Mol. Mass.413.4023
SMILESCN(C)c1cc(nc2c(nc(nc12)N1CCOCC1)-c1cccc(F)c1O)C(O)=O