Reaction Details
TargetPhosphatidylinositol 4,5-bisphosphate 3-kinase catalytic subunit alpha isoform
LigandBDBM109341
Substrate/Competitorn/a
Meas. Tech.Biological Assays
IC50 15±n/a nM
Citation Montagne, CBombrun, ADesforges-Bouscary, GQuattropani, AGaillard, P 2-morpholino-pyrido[3,2-D]pyrimidines US Patent US8609666 Publication Date 12/17/2013
 
Phosphatidylinositol 4,5-bisphosphate 3-kinase catalytic subunit alpha isoform
Name:Phosphatidylinositol 4,5-bisphosphate 3-kinase catalytic subunit alpha isoform
Type:Enzyme Subunit
Mol. Mass.:124294.87
Organism:Homo sapiens (Human)
Description:P42336
Residue:1068
BDBM109341
NameBDBM109341
Synonyms:US8609666, 61
TypeSmall organic molecule
Emp. Form.C23H26N6O6S
Mol. Mass.514.554
SMILESCS(=O)(=O)N1CCN(CC1)c1cc(nc2c(nc(nc12)N1CCOCC1)-c1cccc(O)c1)C(O)=O