Reaction Details
TargetEnteropeptidase
LigandBDBM109613
Substrate/Competitorn/a
Meas. Tech.Inhibition Assay
Ki 0.25±0.0 nM
Citation Konishi, ATokumasu, MSuzuki, TKoshiba, TOhsumi, KIkehara, OKodama, Y Heteroarylcarboxylic acid ester derivative US Patent US8609715 Publication Date 12/17/2013
 
Enteropeptidase
Name:Enteropeptidase
Type:Enzyme
Mol. Mass.:112901.62
Organism:Homo sapiens (Human)
Description:P98073
Residue:1019
BDBM109613
NameBDBM109613
Synonyms:US8609715, A-35
TypeSmall organic molecule
Emp. Form.C20H20FN3O8
Mol. Mass.449.3865
SMILESCC(Cc1ccc(o1)C(=O)Oc1ccc(cc1F)C(N)=N)C(=O)N[C@H](CC(O)=O)C(O)=O