Reaction Details
TargetSerine protease 1
LigandBDBM109659
Substrate/Competitorn/a
Meas. Tech.Inhibition Assay
Ki 0.20±0.0 nM
Citation Konishi, ATokumasu, MSuzuki, TKoshiba, TOhsumi, KIkehara, OKodama, Y Heteroarylcarboxylic acid ester derivative US Patent US8609715 Publication Date 12/17/2013
 
Serine protease 1
Name:Serine protease 1
Type:Enzyme
Mol. Mass.:26557.80
Organism:Homo sapiens (Human)
Description:P07477
Residue:247
BDBM109659
NameBDBM109659
Synonyms:US8609715, A-67
TypeSmall organic molecule
Emp. Form.C20H21N3O8
Mol. Mass.431.396
SMILESCC(Cc1coc(c1)C(=O)Oc1ccc(cc1)C(N)=N)C(=O)N[C@@H](CC(O)=O)C(O)=O