Reaction Details
TargetCathepsin S
LigandBDBM109857
Substrate/Competitorn/a
Meas. Tech.Enzyme Inhibition Assay
Ki 2±0.0 nM
Citation Schudok, MWagner, MBauer, AKohlmann, A Spirocyclic nitriles as protease inhibitors US Patent US8609681 Publication Date 12/17/2013
 
Cathepsin S
Name:Cathepsin S
Type:Protein
Mol. Mass.:37507.38
Organism:Homo sapiens (Human)
Description:P25774
Residue:331
BDBM109857
NameBDBM109857
Synonyms:US8609681, 94
TypeSmall organic molecule
Emp. Form.C24H37F2N5O2
Mol. Mass.465.5797
SMILESCCCC(F)(F)C[C@H](NC(=O)N1CCC2(CCN(CC2)C2CC2)CC1)C(=O)NC1(CC1)C#N