Reaction Details
TargetSerine/threonine-protein kinase pim-1
LigandBDBM110708
Substrate/Competitorn/a
Meas. Tech.Pim Kinase Binding Activity
pH7.2±n/a
Ki 0.01±n/a nM
Commentsextracted
Citation Hodges, AJMatteucci, MSharpe, ASun, MWang, XTsui, VH Pyrazol-4-yl-heterocyclyl-carboxamide compounds and methods of use US Patent US8614206 Publication Date 12/24/2013
 
Serine/threonine-protein kinase pim-1
Name:Serine/threonine-protein kinase pim-1
Type:Protein
Mol. Mass.:35681.82
Organism:Homo sapiens (Human)
Description:P11309
Residue:313
BDBM110708
NameBDBM110708
Synonyms:US8614206, 154
TypeSmall organic molecule
Emp. Form.C20H22F3N7OS
Mol. Mass.465.495
SMILESCn1ncc(NC(=O)c2nc(sc2N)-c2c(F)cccc2F)c1N1CC[C@H](N)C[C@@H](F)C1