Reaction Details
TargetSerine/threonine-protein kinase pim-1
LigandBDBM110747
Substrate/Competitorn/a
Meas. Tech.Pim Kinase Binding Activity
pH7.2±n/a
Ki 0.01±n/a nM
Commentsextracted
Citation Hodges, AJMatteucci, MSharpe, ASun, MWang, XTsui, VH Pyrazol-4-yl-heterocyclyl-carboxamide compounds and methods of use US Patent US8614206 Publication Date 12/24/2013
 
Serine/threonine-protein kinase pim-1
Name:Serine/threonine-protein kinase pim-1
Type:Protein
Mol. Mass.:35681.82
Organism:Homo sapiens (Human)
Description:P11309
Residue:313
BDBM110747
NameBDBM110747
Synonyms:US8614206, 280
TypeSmall organic molecule
Emp. Form.C21H21F6N7OS
Mol. Mass.533.493
SMILESN[C@H]1CCN(CC(F)(F)C1)c1c(NC(=O)c2nc(sc2N)-c2c(F)cccc2F)cnn1CC(F)F