Reaction Details
TargetSerine/threonine-protein kinase pim-1
LigandBDBM110889
Substrate/Competitorn/a
Meas. Tech.Pim Kinase Binding Activity
pH7.2±n/a
Ki 0.425±n/a nM
Commentsextracted
Citation Hodges, AJMatteucci, MSharpe, ASun, MWang, XTsui, VH Pyrazol-4-yl-heterocyclyl-carboxamide compounds and methods of use US Patent US8614206 Publication Date 12/24/2013
 
Serine/threonine-protein kinase pim-1
Name:Serine/threonine-protein kinase pim-1
Type:Protein
Mol. Mass.:35681.82
Organism:Homo sapiens (Human)
Description:P11309
Residue:313
BDBM110889
NameBDBM110889
Synonyms:US8614206, 440 US8614206, 474
TypeSmall organic molecule
Emp. Form.C21H26F2N8O2S
Mol. Mass.492.545
SMILESCOC1(C)CC(N)CCN(C1)c1c(NC(=O)c2nc(sc2N)-c2c(F)cncc2F)cnn1C