Reaction Details
TargetSerine/threonine-protein kinase pim-1
LigandBDBM110963
Substrate/Competitorn/a
Meas. Tech.Pim Kinase Binding Activity
pH7.2±n/a
Ki 0.016±n/a nM
Commentsextracted
Citation Hodges, AJMatteucci, MSharpe, ASun, MWang, XTsui, VH Pyrazol-4-yl-heterocyclyl-carboxamide compounds and methods of use US Patent US8614206 Publication Date 12/24/2013
 
Serine/threonine-protein kinase pim-1
Name:Serine/threonine-protein kinase pim-1
Type:Protein
Mol. Mass.:35681.82
Organism:Homo sapiens (Human)
Description:P11309
Residue:313
BDBM110963
NameBDBM110963
Synonyms:US8614206, 520 | US8614206, 521
TypeSmall organic molecule
Emp. Form.C23H27F2N7O2S
Mol. Mass.503.568
SMILESCOC1C(N)CCN(CC11CC1)c1c(NC(=O)c2nc(sc2N)-c2c(F)cccc2F)cnn1C