Reaction Details
TargetSerine/threonine-protein kinase/endoribonuclease IRE1
LigandBDBM110977
Substrate/Competitorn/a
Meas. Tech.In Vitro Enzyme Assays
pH7.5±n/a
Temperature303.15±n/a K
IC50 120±n/a nM
Citation Patterson, JBLonergan, DGFlynn, GAZeng, QPallai, PV IRE-1α inhibitors US Patent US8614253 Publication Date 12/24/2013
 
Serine/threonine-protein kinase/endoribonuclease IRE1
Name:Serine/threonine-protein kinase/endoribonuclease IRE1
Type:Enzyme
Mol. Mass.:109731.20
Organism:Homo sapiens (Human)
Description:O75460
Residue:977
BDBM110977
NameBDBM110977
Synonyms:US8614253, 3-8
TypeSmall organic molecule
Emp. Form.C9H10O3
Mol. Mass.166.1739
SMILESCOc1cc(C)cc(C=O)c1O