Reaction Details
TargetSerine/threonine-protein kinase/endoribonuclease IRE1
LigandBDBM110994
Substrate/Competitorn/a
Meas. Tech.In Vitro Enzyme Assays
pH7.5±n/a
Temperature303.15±n/a K
IC50 440±n/a nM
Citation Patterson, JBLonergan, DGFlynn, GAZeng, QPallai, PV IRE-1α inhibitors US Patent US8614253 Publication Date 12/24/2013
 
Serine/threonine-protein kinase/endoribonuclease IRE1
Name:Serine/threonine-protein kinase/endoribonuclease IRE1
Type:Enzyme
Mol. Mass.:109731.20
Organism:Homo sapiens (Human)
Description:O75460
Residue:977
BDBM110994
NameBDBM110994
Synonyms:US8614253, 3-25 US9963434, Compound 3-25
TypeSmall organic molecule
Emp. Form.C7H4I2O2
Mol. Mass.373.9144
SMILESOc1c(I)cc(I)cc1C=O