Reaction Details
TargetAngiogenin
LigandBDBM111445
Substrate/Competitorn/a
Meas. Tech.Inhibition Kinetics with Angiogenin
pH6±n/a
Ki 1.251e+6± 4e+3 nM
Commentsextracted
Citation Debnath, JDasgupta, SPathak, T Amino and carboxy functionalized modified nucleosides: a potential class of inhibitors for angiogenin. Bioorg Chem52:56-61 (2014) 
 
Angiogenin
Name:Angiogenin
Type:Protein
Mol. Mass.:16563.00
Organism:Homo sapiens (Human)
Description:n/a
Residue:147
BDBM111445
NameBDBM111445
Synonyms:Tyr-aT (Compound 3)
TypeSmall organic molecule
Emp. Form.C19H24N4O6
Mol. Mass.404.4171
SMILESCc1cn([C@H]2C[C@@H](NC(=O)C(N)Cc3ccc(O)cc3)[C@@H](CO)O2)c(=O)[nH]c1=O