Reaction Details
TargetAngiogenin
LigandBDBM111447
Substrate/Competitorn/a
Meas. Tech.Inhibition Kinetics with Angiogenin
pH6±n/a
Ki 1.114e+6± 3e+3 nM
Commentsextracted
Citation Debnath, JDasgupta, SPathak, T Amino and carboxy functionalized modified nucleosides: a potential class of inhibitors for angiogenin. Bioorg Chem52:56-61 (2014) 
 
Angiogenin
Name:Angiogenin
Type:Protein
Mol. Mass.:16563.00
Organism:Homo sapiens (Human)
Description:n/a
Residue:147
BDBM111447
NameBDBM111447
Synonyms:N-[2-Hydroxymethyl-5-(5-methyl-2,4-dioxo-3,4-dihydro- 2H-pyrimidin-1-yl)-tetrahydro-furan-3-yl]-malonamic acid (Compound 6)
TypeSmall organic molecule
Emp. Form.C13H17N3O7
Mol. Mass.327.29
SMILESCc1cn([C@H]2C[C@@H](NC(=O)CC(O)=O)[C@@H](CO)O2)c(=O)[nH]c1=O