Reaction Details
TargetNitric oxide synthase, brain
LigandBDBM111486
Substrate/Competitorn/a
Meas. Tech.Enzyme Assay
IC50 120±n/a nM
Citation Ramnauth, JAnnedi, SCSilverman, SDove, PMaddaford, SRakhit, S Benzoxazines, benzothiazines, and related compounds having NOS inhibitory activity US Patent US8618286 Publication Date 12/31/2013
 
Nitric oxide synthase, brain
Name:Nitric oxide synthase, brain
Type:Homodimer
Mol. Mass.:160985.98
Organism:Homo sapiens (Human)
Description:P29475
Residue:1434
BDBM111486
NameBDBM111486
Synonyms:US8618286, 12
TypeSmall organic molecule
Emp. Form.C17H22N4S2
Mol. Mass.346.513
SMILESCN(C)CCN1CCSc2cc(ccc12)N=C(N)c1cccs1