Reaction Details
TargetNitric oxide synthase, brain
LigandBDBM111502
Substrate/Competitorn/a
Meas. Tech.Enzyme Assay
IC50 80±n/a nM
Citation Ramnauth, JAnnedi, SCSilverman, SDove, PMaddaford, SRakhit, S Benzoxazines, benzothiazines, and related compounds having NOS inhibitory activity US Patent US8618286 Publication Date 12/31/2013
 
Nitric oxide synthase, brain
Name:Nitric oxide synthase, brain
Type:Homodimer
Mol. Mass.:160985.98
Organism:Homo sapiens (Human)
Description:P29475
Residue:1434
BDBM111502
NameBDBM111502
Synonyms:US8618286, 28
TypeSmall organic molecule
Emp. Form.C16H20N4S2
Mol. Mass.332.487
SMILESCNCCN1CCSc2ccc(cc12)N=C(N)c1cccs1