Reaction Details
Target1,3-beta-glucan synthase
LigandBDBM111590
Substrate/Competitorn/a
Meas. Tech.Glucan Synthase Assay
pH8±n/a
Temperature303.15±n/a K
IC50 8500±n/a nM
Citation Carr, ADNeuss, JCOrchard, MGPorter, DW Substituted aniline derivatives US Patent US8624022 Publication Date 1/7/2014
 
1,3-beta-glucan synthase
Name:1,3-beta-glucan synthase
Type:Enzyme
Mol. Mass.:218006.59
Organism:Candida albicans (Yeast)
Description:O13428
Residue:1897
BDBM111590
NameBDBM111590
Synonyms:US8624022, OGT4325
TypeSmall organic molecule
Emp. Form.C28H26F3N3O3
Mol. Mass.509.5195
SMILESN[C@H]1CCN(C1)C(=O)CN(C(=O)\C=C\c1ccccc1)c1ccc(cc1)-c1cccc(OC(F)(F)F)c1