Reaction Details
Target1,3-beta-glucan synthase
LigandBDBM111595
Substrate/Competitorn/a
Meas. Tech.Glucan Synthase Assay
pH8±n/a
Temperature303.15±n/a K
IC50 5400±n/a nM
Citation Carr, ADNeuss, JCOrchard, MGPorter, DW Substituted aniline derivatives US Patent US8624022 Publication Date 1/7/2014
 
1,3-beta-glucan synthase
Name:1,3-beta-glucan synthase
Type:Enzyme
Mol. Mass.:218006.59
Organism:Candida albicans (Yeast)
Description:O13428
Residue:1897
BDBM111595
NameBDBM111595
Synonyms:US8624022, OGT4155
TypeSmall organic molecule
Emp. Form.C28H28F4N4O3
Mol. Mass.544.5405
SMILESN[C@H]1CCN(C1)C(=O)CN(CC(=O)NCc1cc(F)cc(c1)C(F)(F)F)c1ccc(Oc2ccccc2)cc1