Reaction Details
TargetSerine/threonine-protein kinase mTOR
LigandBDBM111629
Substrate/Competitorn/a
Meas. Tech.Kinase Activity Assay
pH7.5±n/a
Temperature298.15±n/a K
IC50 7±n/a nM
Citation Schneider, SKessler, Dvan der Veen, LWunberg, T 5-alkynyl-pyrimidines US Patent US8618111 Publication Date 12/31/2013
 
Serine/threonine-protein kinase mTOR
Name:Serine/threonine-protein kinase mTOR
Type:Rapamycin target protein
Mol. Mass.:288917.12
Organism:Homo sapiens (Human)
Description:P42345
Residue:2549
BDBM111629
NameBDBM111629
Synonyms:US8618111, B-16
TypeSmall organic molecule
Emp. Form.C24H25N5O
Mol. Mass.399.4882
SMILESCCc1ncnc(N2CCC(O)(CC2)c2ccccc2)c1C#Cc1ccc(N)nc1