Reaction Details
TargetSerine/threonine-protein kinase mTOR
LigandBDBM111666
Substrate/Competitorn/a
Meas. Tech.Kinase Activity Assay
pH7.5±n/a
Temperature298.15±n/a K
IC50 12±n/a nM
Citation Schneider, SKessler, Dvan der Veen, LWunberg, T 5-alkynyl-pyrimidines US Patent US8618111 Publication Date 12/31/2013
 
Serine/threonine-protein kinase mTOR
Name:Serine/threonine-protein kinase mTOR
Type:Rapamycin target protein
Mol. Mass.:288917.12
Organism:Homo sapiens (Human)
Description:P42345
Residue:2549
BDBM111666
NameBDBM111666
Synonyms:US8618111, B-53
TypeSmall organic molecule
Emp. Form.C17H19N5O2S
Mol. Mass.357.43
SMILESCCc1ncnc(N2CCS(=O)(=O)CC2)c1C#Cc1ccc(N)nc1