Reaction Details
TargetSerine/threonine-protein kinase mTOR
LigandBDBM111688
Substrate/Competitorn/a
Meas. Tech.Kinase Activity Assay
pH7.5±n/a
Temperature298.15±n/a K
IC50 10±n/a nM
Citation Schneider, SKessler, Dvan der Veen, LWunberg, T 5-alkynyl-pyrimidines US Patent US8618111 Publication Date 12/31/2013
 
Serine/threonine-protein kinase mTOR
Name:Serine/threonine-protein kinase mTOR
Type:Rapamycin target protein
Mol. Mass.:288917.12
Organism:Homo sapiens (Human)
Description:P42345
Residue:2549
BDBM111688
NameBDBM111688
Synonyms:US8618111, B-75
TypeSmall organic molecule
Emp. Form.C21H24N6O
Mol. Mass.376.4549
SMILESCN1CCC2(CCN(CC2)c2ncnc(C)c2C#Cc2ccc(N)nc2)C1=O