Reaction Details
TargetSerine/threonine-protein kinase mTOR
LigandBDBM111699
Substrate/Competitorn/a
Meas. Tech.Kinase Activity Assay
pH7.5±n/a
Temperature298.15±n/a K
IC50 9±n/a nM
Citation Schneider, SKessler, Dvan der Veen, LWunberg, T 5-alkynyl-pyrimidines US Patent US8618111 Publication Date 12/31/2013
 
Serine/threonine-protein kinase mTOR
Name:Serine/threonine-protein kinase mTOR
Type:Rapamycin target protein
Mol. Mass.:288917.12
Organism:Homo sapiens (Human)
Description:P42345
Residue:2549
BDBM111699
NameBDBM111699
Synonyms:US8618111, B-86
TypeSmall organic molecule
Emp. Form.C20H25N5O
Mol. Mass.351.4454
SMILESCCc1ncnc(N2CCC(CC2)OC)c1C#Cc1ccc(NC)nc1