Reaction Details
TargetSerine/threonine-protein kinase mTOR
LigandBDBM111713
Substrate/Competitorn/a
Meas. Tech.Kinase Activity Assay
pH7.5±n/a
Temperature298.15±n/a K
IC50 18±n/a nM
Citation Schneider, SKessler, Dvan der Veen, LWunberg, T 5-alkynyl-pyrimidines US Patent US8618111 Publication Date 12/31/2013
 
Serine/threonine-protein kinase mTOR
Name:Serine/threonine-protein kinase mTOR
Type:Rapamycin target protein
Mol. Mass.:288917.12
Organism:Homo sapiens (Human)
Description:P42345
Residue:2549
BDBM111713
NameBDBM111713
Synonyms:US8618111, F-5
TypeSmall organic molecule
Emp. Form.C22H28N6O2
Mol. Mass.408.4967
SMILESCOCCC(=O)NCC1CCN(CC1)c1ncnc(C)c1C#Cc1ccc(N)nc1