Reaction Details
TargetSerine/threonine-protein kinase mTOR
LigandBDBM111734
Substrate/Competitorn/a
Meas. Tech.Kinase Activity Assay
pH7.5±n/a
Temperature298.15±n/a K
IC50 15±n/a nM
Citation Schneider, SKessler, Dvan der Veen, LWunberg, T 5-alkynyl-pyrimidines US Patent US8618111 Publication Date 12/31/2013
 
Serine/threonine-protein kinase mTOR
Name:Serine/threonine-protein kinase mTOR
Type:Rapamycin target protein
Mol. Mass.:288917.12
Organism:Homo sapiens (Human)
Description:P42345
Residue:2549
BDBM111734
NameBDBM111734
Synonyms:US8618111, H-6
TypeSmall organic molecule
Emp. Form.C20H23N5O
Mol. Mass.349.4295
SMILESCCc1ncnc(N2CCC3(COC3)CC2)c1C#Cc1ccc(N)nc1