Reaction Details
TargetSerine/threonine-protein kinase mTOR
LigandBDBM111752
Substrate/Competitorn/a
Meas. Tech.Kinase Activity Assay
pH7.5±n/a
Temperature298.15±n/a K
IC50 14±n/a nM
Citation Schneider, SKessler, Dvan der Veen, LWunberg, T 5-alkynyl-pyrimidines US Patent US8618111 Publication Date 12/31/2013
 
Serine/threonine-protein kinase mTOR
Name:Serine/threonine-protein kinase mTOR
Type:Rapamycin target protein
Mol. Mass.:288917.12
Organism:Homo sapiens (Human)
Description:P42345
Residue:2549
BDBM111752
NameBDBM111752
Synonyms:US8618111, H-25
TypeSmall organic molecule
Emp. Form.C21H22N8
Mol. Mass.386.453
SMILESCCc1ncnc(N2CCN(CC2)c2ncccn2)c1C#Cc1ccc(N)nc1