Reaction Details
TargetPhosphatidylinositol 4,5-bisphosphate 3-kinase catalytic subunit alpha isoform
LigandBDBM111676
Substrate/Competitorn/a
Meas. Tech.Filter-Binding-Assay
pH7.5±n/a
Temperature273.15±n/a K
IC50 15±n/a nM
Citation Schneider, SKessler, Dvan der Veen, LWunberg, T 5-alkynyl-pyrimidines US Patent US8618111 Publication Date 12/31/2013
 
Phosphatidylinositol 4,5-bisphosphate 3-kinase catalytic subunit alpha isoform
Name:Phosphatidylinositol 4,5-bisphosphate 3-kinase catalytic subunit alpha isoform
Type:Enzyme Subunit
Mol. Mass.:124294.87
Organism:Homo sapiens (Human)
Description:P42336
Residue:1068
BDBM111676
NameBDBM111676
Synonyms:US8618111, B-63
TypeSmall organic molecule
Emp. Form.C21H27N5O
Mol. Mass.365.472
SMILESCCc1ncnc(N2CCC(O)(CC2)C(C)C)c1C#Cc1ccc(N)nc1