Reaction Details
TargetTyrosine-protein kinase JAK3
LigandBDBM112606
Substrate/Competitorn/a
Meas. Tech.Inhibition Assay
pH7.2±n/a
Ki 0.00625±n/a nM
IC50 0.012505±n/a nM
Citation de Vicente Fidalgo, JHermann, JCLemoine, RLi, HLovey, AJSjogren, EBSoth, M Inhibitors of JAK US Patent US8618103 Publication Date 12/31/2013
 
Tyrosine-protein kinase JAK3
Name:Tyrosine-protein kinase JAK3
Type:Protein
Mol. Mass.:125111.08
Organism:Homo sapiens (Human)
Description:P52333
Residue:1124
BDBM112606
NameBDBM112606
Synonyms:US8618103, I-102
TypeSmall organic molecule
Emp. Form.C20H23N9O2S
Mol. Mass.453.521
SMILESCS(=O)(=O)N1CCC[C@@H](C1)Nc1nc(ncc1-c1cnc2[nH]ccc2n1)N1CC(C1)C#N