Reaction Details
TargetTyrosine-protein kinase JAK3
LigandBDBM112607
Substrate/Competitorn/a
Meas. Tech.Inhibition Assay
pH7.2±n/a
Ki 0.00679±n/a nM
IC50 0.013595±n/a nM
Citation de Vicente Fidalgo, JHermann, JCLemoine, RLi, HLovey, AJSjogren, EBSoth, M Inhibitors of JAK US Patent US8618103 Publication Date 12/31/2013
 
Tyrosine-protein kinase JAK3
Name:Tyrosine-protein kinase JAK3
Type:Protein
Mol. Mass.:125111.08
Organism:Homo sapiens (Human)
Description:P52333
Residue:1124
BDBM112607
NameBDBM112607
Synonyms:US8618103, I-103
TypeSmall organic molecule
Emp. Form.C23H29N9O2S
Mol. Mass.495.6
SMILESCS(=O)(=O)N1CCC[C@@H](C1)Nc1nc(NC2CCC(CC2)C#N)ncc1-c1cnc2[nH]ccc2n1