Reaction Details
TargetTyrosine-protein kinase JAK3
LigandBDBM112613
Substrate/Competitorn/a
Meas. Tech.Inhibition Assay
pH7.2±n/a
Ki 0.01081±n/a nM
IC50 0.021635±n/a nM
Citation de Vicente Fidalgo, JHermann, JCLemoine, RLi, HLovey, AJSjogren, EBSoth, M Inhibitors of JAK US Patent US8618103 Publication Date 12/31/2013
 
Tyrosine-protein kinase JAK3
Name:Tyrosine-protein kinase JAK3
Type:Protein
Mol. Mass.:125111.08
Organism:Homo sapiens (Human)
Description:P52333
Residue:1124
BDBM112613
NameBDBM112613
Synonyms:US8618103, I-109
TypeSmall organic molecule
Emp. Form.C22H31N9O2S
Mol. Mass.485.606
SMILESCN(C)[C@@H]1CCN(C1)c1ncc(c(N[C@H]2CCCN(C2)S(C)(=O)=O)n1)-c1cnc2[nH]ccc2n1