Reaction Details
TargetTyrosine-protein kinase JAK2
LigandBDBM112506
Substrate/Competitorn/a
Meas. Tech.Inhibition Assay
pH7.2±n/a
IC50 0.0292±n/a nM
Citation de Vicente Fidalgo, JHermann, JCLemoine, RLi, HLovey, AJSjogren, EBSoth, M Inhibitors of JAK US Patent US8618103 Publication Date 12/31/2013
 
Tyrosine-protein kinase JAK2
Name:Tyrosine-protein kinase JAK2
Type:Protein
Mol. Mass.:130684.68
Organism:Homo sapiens (Human)
Description:O60674
Residue:1132
BDBM112506
NameBDBM112506
Synonyms:US8618103, I-2
TypeSmall organic molecule
Emp. Form.C17H20N6O2S
Mol. Mass.372.445
SMILESCS(=O)(=O)N1CCC[C@H](C1)Nc1ncccc1-c1cnc2[nH]ccc2n1